General discussion on installation and configuration of SOGo

Text archives Help


[SOGo] sogo/openchange compile error


Chronological Thread 
  • From: Marc Cyr < >
  • To:
  • Subject: [SOGo] sogo/openchange compile error
  • Date: Wed, 30 Oct 2013 13:29:23 -0400

Hello everyone,

I'm trying to compile sogo/openchange plugin from Ubuntu 12.04 64bit

I am getting this:

This is gnustep-make 2.6.1. Type 'make print-gnustep-make-help' for help.
 Python executable: /usr/bin/python
Making all for bundle SOGoBackend...
 Compiling file MAPIStoreFolder.m ...
MAPIStoreFolder.m: In function â-[MAPIStoreFolder deleteMessageWithMID:andFlags:]â:
MAPIStoreFolder.m:613:51: error: âPR_NORMAL_MESSAGE_SIZEâ undeclared (first use in this function)
MAPIStoreFolder.m:613:51: note: each undeclared identifier is reported only once for each function it appears in
MAPIStoreFolder.m: In function â-[MAPIStoreFolder postNotificationsForMoveCopyMessagesWithMIDs:andMessageURLs:andCount:fromFolder:withMIDs:wantCopy:]â:
MAPIStoreFolder.m:999:35: error: âPR_NORMAL_MESSAGE_SIZEâ undeclared (first use in this function)
make[3]: *** [obj/SOGoBackend.obj/MAPIStoreFolder.m.o] Error 1
make[2]: *** [internal-bundle-run-compile-submake] Error 2
make[1]: *** [SOGoBackend.all.bundle.variables] Error 2
make: *** [internal-all] Error 2


Have anyone seen this before?


  • [SOGo] sogo/openchange compile error, Marc Cyr, 10/30/2013

Archive powered by MHonArc 2.6.18.

Top of page